{"text_format":"1","workbook":"xlsx","n_sheets":4,"sheets":["NextSeq","MiSeq-SampleSheet","Password_ForSheet","BarcodeKey"],"not_rendered":{"charts":0,"images":0,"macros":1,"external_links":0,"defined_names":0,"comments":0,"pivot_tables":0},"unopened":[],"bounds":{"document_bytes":16777216,"sheet_cells":100000,"rows_first":2000,"rows_last":500,"rows_between":2000,"halvings":0,"cell_chars":16384,"cell_head_chars":4096},"cells_cut":0,"cells_raw":0,"read":"whole","date_system":"1900"}

{"sheet":"NextSeq","index":0,"n_rows":276,"n_cols":16,"rows_kept":276,"cut":false,"hidden":false,"merged":[]}
["[Header]"]
["IEMFileVersion",5]
["Experiment Name","NextSeqEnter"]
["Date",{"$f":"TEXT(TODAY(), \"yyyy-mm-dd\")","v":"2023-07-28"}]
["Workflow","GenerateFASTQ"]
["Application","NextSeq FASTQ Only"]
["Instrument Type","NextSeq/MiniSeq"]
["Assay","TruSeq Amplicon"]
["Description","EnterNameHere"]
["Chemistry","Amplicon"]
[]
["[Reads]"]
[151]
[151]
[]
["[Settings]"]
["ReverseComplement",0]
[null,null,null,null,null,null,"MISEQ P501","TATAGCCT"]
["[Data]"]
["Sample_ID","Sample_Name","Sample_Plate","Sample_Well","i7_Index_ID","index","i5_Index_ID","index2","Sample_Project","Description","Check Sample_ID uniqueness","Check_index_uniqueness"]
[null,{"$f":"IF(A21=\"\",\"\",A21)","v":""},null,null,null,{"$f":"IF(E21=\"\", \"\",VLOOKUP(E21, BarcodeKey!B:C, 2, FALSE))","v":""},null,{"$f":"IF(G21=\"\", \"\", VLOOKUP(G21,BarcodeKey!H:J, 3, FALSE))","v":""},null,null,{"$f":"IF(AND(A21=\"\",E21=\"\",G21=\"\"), \"\", IF(AND(A21=\"\", OR(E21<>\"\", G21<>\"\")), \"EnterSmpl_ID\",COUNTIF(A$20:A$104877,A21)))","v":""},{"$f":"IF(OR(ISERROR(F21)=TRUE, ISERROR(H21)= TRUE), \"Error\", IF(AND(F21=\"\",H21=\"\", A21=\"\"), \"\", IF(OR(F21=\"\", H21=\"\"), \"inComplete\", COUNTIFS(F:F,F21, H:H,H21))))","v":""}]
[null,{"$f":"IF(A22=\"\",\"\",A22)","v":""},null,null,null,{"$f":"IF(E22=\"\", \"\",VLOOKUP(E22, BarcodeKey!B:C, 2, FALSE))","v":""},null,{"$f":"IF(G22=\"\", \"\", VLOOKUP(G22,BarcodeKey!H:J, 3, FALSE))","v":""},null,null,"",{"$f":"IF(OR(ISERROR(F22)=TRUE, ISERROR(H22)= TRUE), \"Error\", IF(AND(F22=\"\",H22=\"\", A22=\"\"), \"\", IF(OR(F22=\"\", H22=\"\"), \"inComplete\", COUNTIFS(F:F,F22, H:H,H22))))","v":""}]
[null,"",null,null,null,{"$f":"IF(E23=\"\", \"\",VLOOKUP(E23, BarcodeKey!B:C, 2, FALSE))","v":""},null,{"$f":"IF(G23=\"\", \"\", VLOOKUP(G23,BarcodeKey!H:J, 3, FALSE))","v":""},null,null,"",""]
[null,"",null,null,null,{"$f":"IF(E24=\"\", \"\",VLOOKUP(E24, BarcodeKey!B:C, 2, FALSE))","v":""},null,{"$f":"IF(G24=\"\", \"\", VLOOKUP(G24,BarcodeKey!H:J, 3, FALSE))","v":""},null,null,"",""]
[null,"",null,null,null,{"$f":"IF(E25=\"\", \"\",VLOOKUP(E25, BarcodeKey!B:C, 2, FALSE))","v":""},null,{"$f":"IF(G25=\"\", \"\", VLOOKUP(G25,BarcodeKey!H:J, 3, FALSE))","v":""},null,null,"",""]
[null,"",null,null,null,{"$f":"IF(E26=\"\", \"\",VLOOKUP(E26, BarcodeKey!B:C, 2, FALSE))","v":""},null,{"$f":"IF(G26=\"\", \"\", VLOOKUP(G26,BarcodeKey!H:J, 3, FALSE))","v":""},null,null,"",""]
[null,"",null,null,null,{"$f":"IF(E27=\"\", \"\",VLOOKUP(E27, BarcodeKey!B:C, 2, FALSE))","v":""},null,{"$f":"IF(G27=\"\", \"\", VLOOKUP(G27,BarcodeKey!H:J, 3, FALSE))","v":""},null,null,"","",null,null,"Instruction: "]
[null,"",null,null,null,{"$f":"IF(E28=\"\", \"\",VLOOKUP(E28, BarcodeKey!B:C, 2, FALSE))","v":""},null,{"$f":"IF(G28=\"\", \"\", VLOOKUP(G28,BarcodeKey!H:J, 3, FALSE))","v":""},null,null,"","",null,null,null," - Shaded cells: user input"]
[null,"",null,null,null,{"$f":"IF(E29=\"\", \"\",VLOOKUP(E29, BarcodeKey!B:C, 2, FALSE))","v":""},null,{"$f":"IF(G29=\"\", \"\", VLOOKUP(G29,BarcodeKey!H:J, 3, FALSE))","v":""},null,null,"","",null,null,null," - Run \"Check Sample_ID\" : any  Sample_IDs with illegal characters will be highlighted in RED"]
[null,"",null,null,null,{"$f":"IF(E30=\"\", \"\",VLOOKUP(E30, BarcodeKey!B:C, 2, FALSE))","v":""},null,{"$f":"IF(G30=\"\", \"\", VLOOKUP(G30,BarcodeKey!H:J, 3, FALSE))","v":""},null,null,"","",null,null,null," - Remove the illegal characters from the RED Sample_IDs"]
[null,"",null,null,null,{"$f":"IF(E31=\"\", \"\",VLOOKUP(E31, BarcodeKey!B:C, 2, FALSE))","v":""},null,{"$f":"IF(G31=\"\", \"\", VLOOKUP(G31,BarcodeKey!H:J, 3, FALSE))","v":""},null,null,"","",null,null,null," - Run \"ReSet Sample_ID Color\"  to reset the red Sample_IDs to black font"]
[null,"",null,null,null,{"$f":"IF(E32=\"\", \"\",VLOOKUP(E32, BarcodeKey!B:C, 2, FALSE))","v":""},null,{"$f":"IF(G32=\"\", \"\", VLOOKUP(G32,BarcodeKey!H:J, 3, FALSE))","v":""},null,null,"","",null,null,null," - Re-run \"Check Sample_ID\" to confirm that the illegal characters are removed: All green"]
[null,"",null,null,null,{"$f":"IF(E33=\"\", \"\",VLOOKUP(E33, BarcodeKey!B:C, 2, FALSE))","v":""},null,{"$f":"IF(G33=\"\", \"\", VLOOKUP(G33,BarcodeKey!H:J, 3, FALSE))","v":""},null,null,"","",null,null,null,"When no Red in any field:"]
[null,"",null,null,null,{"$f":"IF(E34=\"\", \"\",VLOOKUP(E34, BarcodeKey!B:C, 2, FALSE))","v":""},null,{"$f":"IF(G34=\"\", \"\", VLOOKUP(G34,BarcodeKey!H:J, 3, FALSE))","v":""},null,null,"","",null,null,null,"  - Click \"Export\" to export the .CSV file for sample sheet"]
[null,"",null,null,null,{"$f":"IF(E35=\"\", \"\",VLOOKUP(E35, BarcodeKey!B:C, 2, FALSE))","v":""},null,{"$f":"IF(G35=\"\", \"\", VLOOKUP(G35,BarcodeKey!H:J, 3, FALSE))","v":""},null,null,"",""]
[null,"",null,null,null,{"$f":"IF(E36=\"\", \"\",VLOOKUP(E36, BarcodeKey!B:C, 2, FALSE))","v":""},null,{"$f":"IF(G36=\"\", \"\", VLOOKUP(G36,BarcodeKey!H:J, 3, FALSE))","v":""},null,null,"","",null,null,"Characters allowed in the sample_ID:"]
[null,"",null,null,null,{"$f":"IF(E37=\"\", \"\",VLOOKUP(E37, BarcodeKey!B:C, 2, FALSE))","v":""},null,{"$f":"IF(G37=\"\", \"\", VLOOKUP(G37,BarcodeKey!H:J, 3, FALSE))","v":""},null,null,"","",null,null,null," - Alphanumeric characters"]
[null,"",null,null,null,{"$f":"IF(E38=\"\", \"\",VLOOKUP(E38, BarcodeKey!B:C, 2, FALSE))","v":""},null,{"$f":"IF(G38=\"\", \"\", VLOOKUP(G38,BarcodeKey!H:J, 3, FALSE))","v":""},null,null,"","",null,null,null," - Dash (-) and underscore (_)"]
[null,"",null,null,null,{"$f":"IF(E39=\"\", \"\",VLOOKUP(E39, BarcodeKey!B:C, 2, FALSE))","v":""},null,{"$f":"IF(G39=\"\", \"\", VLOOKUP(G39,BarcodeKey!H:J, 3, FALSE))","v":""},null,null,"",""]
[null,"",null,null,null,{"$f":"IF(E40=\"\", \"\",VLOOKUP(E40, BarcodeKey!B:C, 2, FALSE))","v":""},null,{"$f":"IF(G40=\"\", \"\", VLOOKUP(G40,BarcodeKey!H:J, 3, FALSE))","v":""},null,null,"",""]
[null,"",null,null,null,{"$f":"IF(E41=\"\", \"\",VLOOKUP(E41, BarcodeKey!B:C, 2, FALSE))","v":""},null,{"$f":"IF(G41=\"\", \"\", VLOOKUP(G41,BarcodeKey!H:J, 3, FALSE))","v":""},null,null,"",""]
[null,"",null,null,null,{"$f":"IF(E42=\"\", \"\",VLOOKUP(E42, BarcodeKey!B:C, 2, FALSE))","v":""},null,{"$f":"IF(G42=\"\", \"\", VLOOKUP(G42,BarcodeKey!H:J, 3, FALSE))","v":""},null,null,"",""]
[null,"",null,null,null,{"$f":"IF(E43=\"\", \"\",VLOOKUP(E43, BarcodeKey!B:C, 2, FALSE))","v":""},null,{"$f":"IF(G43=\"\", \"\", VLOOKUP(G43,BarcodeKey!H:J, 3, FALSE))","v":""},null,null,"",""]
[null,"",null,null,null,{"$f":"IF(E44=\"\", \"\",VLOOKUP(E44, BarcodeKey!B:C, 2, FALSE))","v":""},null,{"$f":"IF(G44=\"\", \"\", VLOOKUP(G44,BarcodeKey!H:J, 3, FALSE))","v":""},null,null,"",""]
[null,"",null,null,null,{"$f":"IF(E45=\"\", \"\",VLOOKUP(E45, BarcodeKey!B:C, 2, FALSE))","v":""},null,{"$f":"IF(G45=\"\", \"\", VLOOKUP(G45,BarcodeKey!H:J, 3, FALSE))","v":""},null,null,"",""]
[null,"",null,null,null,{"$f":"IF(E46=\"\", \"\",VLOOKUP(E46, BarcodeKey!B:C, 2, FALSE))","v":""},null,{"$f":"IF(G46=\"\", \"\", VLOOKUP(G46,BarcodeKey!H:J, 3, FALSE))","v":""},null,null,"",""]
[null,"",null,null,null,{"$f":"IF(E47=\"\", \"\",VLOOKUP(E47, BarcodeKey!B:C, 2, FALSE))","v":""},null,{"$f":"IF(G47=\"\", \"\", VLOOKUP(G47,BarcodeKey!H:J, 3, FALSE))","v":""},null,null,"",""]
[null,"",null,null,null,{"$f":"IF(E48=\"\", \"\",VLOOKUP(E48, BarcodeKey!B:C, 2, FALSE))","v":""},null,{"$f":"IF(G48=\"\", \"\", VLOOKUP(G48,BarcodeKey!H:J, 3, FALSE))","v":""},null,null,"",""]
[null,"",null,null,null,{"$f":"IF(E49=\"\", \"\",VLOOKUP(E49, BarcodeKey!B:C, 2, FALSE))","v":""},null,{"$f":"IF(G49=\"\", \"\", VLOOKUP(G49,BarcodeKey!H:J, 3, FALSE))","v":""},null,null,"",""]
[null,"",null,null,null,{"$f":"IF(E50=\"\", \"\",VLOOKUP(E50, BarcodeKey!B:C, 2, FALSE))","v":""},null,{"$f":"IF(G50=\"\", \"\", VLOOKUP(G50,BarcodeKey!H:J, 3, FALSE))","v":""},null,null,"",""]
[null,"",null,null,null,{"$f":"IF(E51=\"\", \"\",VLOOKUP(E51, BarcodeKey!B:C, 2, FALSE))","v":""},null,{"$f":"IF(G51=\"\", \"\", VLOOKUP(G51,BarcodeKey!H:J, 3, FALSE))","v":""},null,null,"",""]
[null,"",null,null,null,{"$f":"IF(E52=\"\", \"\",VLOOKUP(E52, BarcodeKey!B:C, 2, FALSE))","v":""},null,{"$f":"IF(G52=\"\", \"\", VLOOKUP(G52,BarcodeKey!H:J, 3, FALSE))","v":""},null,null,"",""]
[null,"",null,null,null,{"$f":"IF(E53=\"\", \"\",VLOOKUP(E53, BarcodeKey!B:C, 2, FALSE))","v":""},null,{"$f":"IF(G53=\"\", \"\", VLOOKUP(G53,BarcodeKey!H:J, 3, FALSE))","v":""},null,null,"",""]
[null,"",null,null,null,{"$f":"IF(E54=\"\", \"\",VLOOKUP(E54, BarcodeKey!B:C, 2, FALSE))","v":""},null,{"$f":"IF(G54=\"\", \"\", VLOOKUP(G54,BarcodeKey!H:J, 3, FALSE))","v":""},null,null,"",""]
[null,"",null,null,null,{"$f":"IF(E55=\"\", \"\",VLOOKUP(E55, BarcodeKey!B:C, 2, FALSE))","v":""},null,{"$f":"IF(G55=\"\", \"\", VLOOKUP(G55,BarcodeKey!H:J, 3, FALSE))","v":""},null,null,"",""]
[null,"",null,null,null,{"$f":"IF(E56=\"\", \"\",VLOOKUP(E56, BarcodeKey!B:C, 2, FALSE))","v":""},null,{"$f":"IF(G56=\"\", \"\", VLOOKUP(G56,BarcodeKey!H:J, 3, FALSE))","v":""},null,null,"",""]
[null,"",null,null,null,{"$f":"IF(E57=\"\", \"\",VLOOKUP(E57, BarcodeKey!B:C, 2, FALSE))","v":""},null,{"$f":"IF(G57=\"\", \"\", VLOOKUP(G57,BarcodeKey!H:J, 3, FALSE))","v":""},null,null,"",""]
[null,"",null,null,null,{"$f":"IF(E58=\"\", \"\",VLOOKUP(E58, BarcodeKey!B:C, 2, FALSE))","v":""},null,{"$f":"IF(G58=\"\", \"\", VLOOKUP(G58,BarcodeKey!H:J, 3, FALSE))","v":""},null,null,"",""]
[null,"",null,null,null,{"$f":"IF(E59=\"\", \"\",VLOOKUP(E59, BarcodeKey!B:C, 2, FALSE))","v":""},null,{"$f":"IF(G59=\"\", \"\", VLOOKUP(G59,BarcodeKey!H:J, 3, FALSE))","v":""},null,null,"",""]
[null,"",null,null,null,{"$f":"IF(E60=\"\", \"\",VLOOKUP(E60, BarcodeKey!B:C, 2, FALSE))","v":""},null,{"$f":"IF(G60=\"\", \"\", VLOOKUP(G60,BarcodeKey!H:J, 3, FALSE))","v":""},null,null,"",""]
{"$rows_left_out":217}
{"sheet":"MiSeq-SampleSheet","index":1,"n_rows":276,"n_cols":16,"rows_kept":276,"cut":false,"hidden":false,"merged":[]}
["[Header]"]
["IEMFileVersion",4]
["Investigator Name"]
["Experiment Name"]
["Date",{"$f":"TEXT(TODAY(), \"yyyy-mm-dd\")","v":"2023-07-28"}]
["Workflow","GenerateFASTQ"]
["Application","FASTQ Only"]
["Assay","TruSeq Amplicon"]
["Description","EnterNameHere"]
["Chemistry","Amplicon"]
[]
["[Reads]"]
[151]
[151]
[]
["[Settings]"]
["ReverseComplement",0]
[]
["[Data]"]
["Sample_ID","Sample_Name","Sample_Plate","Sample_Well","i7_Index_ID","index","i5_Index_ID","index2","Sample_Project","Description","Check Sample_ID uniqueness","Check_index_uniqueness"]
[null,{"$f":"IF(A21=\"\",\"\",A21)","v":""},null,null,null,{"$f":"IF(E21=\"\", \"\",VLOOKUP(E21, BarcodeKey!B:C, 2, FALSE))","v":""},null,{"$f":"IF(G21=\"\", \"\", VLOOKUP(G21,BarcodeKey!H:J, 2, FALSE))","v":""},null,null,{"$f":"IF(AND(A21=\"\",E21=\"\",G21=\"\"), \"\", IF(AND(A21=\"\", OR(E21<>\"\", G21<>\"\")), \"EnterSmpl_ID\",COUNTIF(A$20:A$104877,A21)))","v":""},{"$f":"IF(OR(ISERROR(F21)=TRUE, ISERROR(H21)= TRUE), \"Error\", IF(AND(F21=\"\",H21=\"\", A21=\"\"), \"\", IF(OR(F21=\"\", H21=\"\"), \"inComplete\", COUNTIFS(F:F,F21, H:H,H21))))","v":""}]
[null,{"$f":"IF(A22=\"\",\"\",A22)","v":""},null,null,null,{"$f":"IF(E22=\"\", \"\",VLOOKUP(E22, BarcodeKey!B:C, 2, FALSE))","v":""},null,{"$f":"IF(G22=\"\", \"\", VLOOKUP(G22,BarcodeKey!H:J, 2, FALSE))","v":""},null,null,"",{"$f":"IF(OR(ISERROR(F22)=TRUE, ISERROR(H22)= TRUE), \"Error\", IF(AND(F22=\"\",H22=\"\", A22=\"\"), \"\", IF(OR(F22=\"\", H22=\"\"), \"inComplete\", COUNTIFS(F:F,F22, H:H,H22))))","v":""}]
[null,"",null,null,null,{"$f":"IF(E23=\"\", \"\",VLOOKUP(E23, BarcodeKey!B:C, 2, FALSE))","v":""},null,{"$f":"IF(G23=\"\", \"\", VLOOKUP(G23,BarcodeKey!H:J, 2, FALSE))","v":""},null,null,"",""]
[null,"",null,null,null,{"$f":"IF(E24=\"\", \"\",VLOOKUP(E24, BarcodeKey!B:C, 2, FALSE))","v":""},null,{"$f":"IF(G24=\"\", \"\", VLOOKUP(G24,BarcodeKey!H:J, 2, FALSE))","v":""},null,null,"",""]
[null,"",null,null,null,{"$f":"IF(E25=\"\", \"\",VLOOKUP(E25, BarcodeKey!B:C, 2, FALSE))","v":""},null,{"$f":"IF(G25=\"\", \"\", VLOOKUP(G25,BarcodeKey!H:J, 2, FALSE))","v":""},null,null,"",""]
[null,"",null,null,null,{"$f":"IF(E26=\"\", \"\",VLOOKUP(E26, BarcodeKey!B:C, 2, FALSE))","v":""},null,{"$f":"IF(G26=\"\", \"\", VLOOKUP(G26,BarcodeKey!H:J, 2, FALSE))","v":""},null,null,"",""]
[null,"",null,null,null,{"$f":"IF(E27=\"\", \"\",VLOOKUP(E27, BarcodeKey!B:C, 2, FALSE))","v":""},null,{"$f":"IF(G27=\"\", \"\", VLOOKUP(G27,BarcodeKey!H:J, 2, FALSE))","v":""},null,null,"","",null,null,"Instruction: "]
[null,"",null,null,null,{"$f":"IF(E28=\"\", \"\",VLOOKUP(E28, BarcodeKey!B:C, 2, FALSE))","v":""},null,{"$f":"IF(G28=\"\", \"\", VLOOKUP(G28,BarcodeKey!H:J, 2, FALSE))","v":""},null,null,"","",null,null,null," - Shaded cells: user input"]
[null,"",null,null,null,{"$f":"IF(E29=\"\", \"\",VLOOKUP(E29, BarcodeKey!B:C, 2, FALSE))","v":""},null,{"$f":"IF(G29=\"\", \"\", VLOOKUP(G29,BarcodeKey!H:J, 2, FALSE))","v":""},null,null,"","",null,null,null," - Run \"Check Sample_ID\" : any  Sample_IDs with illegal characters will be highlighted in RED"]
[null,"",null,null,null,{"$f":"IF(E30=\"\", \"\",VLOOKUP(E30, BarcodeKey!B:C, 2, FALSE))","v":""},null,{"$f":"IF(G30=\"\", \"\", VLOOKUP(G30,BarcodeKey!H:J, 2, FALSE))","v":""},null,null,"","",null,null,null," - Remove the illegal characters from the RED Sample_IDs"]
[null,"",null,null,null,{"$f":"IF(E31=\"\", \"\",VLOOKUP(E31, BarcodeKey!B:C, 2, FALSE))","v":""},null,{"$f":"IF(G31=\"\", \"\", VLOOKUP(G31,BarcodeKey!H:J, 2, FALSE))","v":""},null,null,"","",null,null,null," - Run \"ReSet Sample_ID Color\"  to reset the red Sample_IDs to black font"]
[null,"",null,null,null,{"$f":"IF(E32=\"\", \"\",VLOOKUP(E32, BarcodeKey!B:C, 2, FALSE))","v":""},null,{"$f":"IF(G32=\"\", \"\", VLOOKUP(G32,BarcodeKey!H:J, 2, FALSE))","v":""},null,null,"","",null,null,null," - Re-run \"Check Sample_ID\" to confirm that the illegal characters are removed: All green"]
[null,"",null,null,null,{"$f":"IF(E33=\"\", \"\",VLOOKUP(E33, BarcodeKey!B:C, 2, FALSE))","v":""},null,{"$f":"IF(G33=\"\", \"\", VLOOKUP(G33,BarcodeKey!H:J, 2, FALSE))","v":""},null,null,"","",null,null,null,"When no Red in any field:"]
[null,"",null,null,null,{"$f":"IF(E34=\"\", \"\",VLOOKUP(E34, BarcodeKey!B:C, 2, FALSE))","v":""},null,{"$f":"IF(G34=\"\", \"\", VLOOKUP(G34,BarcodeKey!H:J, 2, FALSE))","v":""},null,null,"","",null,null,null,"  - Click \"Export\" to export the .CSV file for sample sheet"]
[null,"",null,null,null,{"$f":"IF(E35=\"\", \"\",VLOOKUP(E35, BarcodeKey!B:C, 2, FALSE))","v":""},null,{"$f":"IF(G35=\"\", \"\", VLOOKUP(G35,BarcodeKey!H:J, 2, FALSE))","v":""},null,null,"",""]
[null,"",null,null,null,{"$f":"IF(E36=\"\", \"\",VLOOKUP(E36, BarcodeKey!B:C, 2, FALSE))","v":""},null,{"$f":"IF(G36=\"\", \"\", VLOOKUP(G36,BarcodeKey!H:J, 2, FALSE))","v":""},null,null,"","",null,null,"Characters allowed in the sample_ID:"]
[null,"",null,null,null,{"$f":"IF(E37=\"\", \"\",VLOOKUP(E37, BarcodeKey!B:C, 2, FALSE))","v":""},null,{"$f":"IF(G37=\"\", \"\", VLOOKUP(G37,BarcodeKey!H:J, 2, FALSE))","v":""},null,null,"","",null,null,null," - Alphanumeric characters"]
[null,"",null,null,null,{"$f":"IF(E38=\"\", \"\",VLOOKUP(E38, BarcodeKey!B:C, 2, FALSE))","v":""},null,{"$f":"IF(G38=\"\", \"\", VLOOKUP(G38,BarcodeKey!H:J, 2, FALSE))","v":""},null,null,"","",null,null,null," - Dash (-) and underscore (_)"]
[null,"",null,null,null,{"$f":"IF(E39=\"\", \"\",VLOOKUP(E39, BarcodeKey!B:C, 2, FALSE))","v":""},null,{"$f":"IF(G39=\"\", \"\", VLOOKUP(G39,BarcodeKey!H:J, 2, FALSE))","v":""},null,null,"",""]
[null,"",null,null,null,{"$f":"IF(E40=\"\", \"\",VLOOKUP(E40, BarcodeKey!B:C, 2, FALSE))","v":""},null,{"$f":"IF(G40=\"\", \"\", VLOOKUP(G40,BarcodeKey!H:J, 2, FALSE))","v":""},null,null,"",""]
[null,"",null,null,null,{"$f":"IF(E41=\"\", \"\",VLOOKUP(E41, BarcodeKey!B:C, 2, FALSE))","v":""},null,{"$f":"IF(G41=\"\", \"\", VLOOKUP(G41,BarcodeKey!H:J, 2, FALSE))","v":""},null,null,"",""]
[null,"",null,null,null,{"$f":"IF(E42=\"\", \"\",VLOOKUP(E42, BarcodeKey!B:C, 2, FALSE))","v":""},null,{"$f":"IF(G42=\"\", \"\", VLOOKUP(G42,BarcodeKey!H:J, 2, FALSE))","v":""},null,null,"",""]
[null,"",null,null,null,{"$f":"IF(E43=\"\", \"\",VLOOKUP(E43, BarcodeKey!B:C, 2, FALSE))","v":""},null,{"$f":"IF(G43=\"\", \"\", VLOOKUP(G43,BarcodeKey!H:J, 2, FALSE))","v":""},null,null,"",""]
[null,"",null,null,null,{"$f":"IF(E44=\"\", \"\",VLOOKUP(E44, BarcodeKey!B:C, 2, FALSE))","v":""},null,{"$f":"IF(G44=\"\", \"\", VLOOKUP(G44,BarcodeKey!H:J, 2, FALSE))","v":""},null,null,"",""]
[null,"",null,null,null,{"$f":"IF(E45=\"\", \"\",VLOOKUP(E45, BarcodeKey!B:C, 2, FALSE))","v":""},null,{"$f":"IF(G45=\"\", \"\", VLOOKUP(G45,BarcodeKey!H:J, 2, FALSE))","v":""},null,null,"",""]
[null,"",null,null,null,{"$f":"IF(E46=\"\", \"\",VLOOKUP(E46, BarcodeKey!B:C, 2, FALSE))","v":""},null,{"$f":"IF(G46=\"\", \"\", VLOOKUP(G46,BarcodeKey!H:J, 2, FALSE))","v":""},null,null,"",""]
[null,"",null,null,null,{"$f":"IF(E47=\"\", \"\",VLOOKUP(E47, BarcodeKey!B:C, 2, FALSE))","v":""},null,{"$f":"IF(G47=\"\", \"\", VLOOKUP(G47,BarcodeKey!H:J, 2, FALSE))","v":""},null,null,"",""]
[null,"",null,null,null,{"$f":"IF(E48=\"\", \"\",VLOOKUP(E48, BarcodeKey!B:C, 2, FALSE))","v":""},null,{"$f":"IF(G48=\"\", \"\", VLOOKUP(G48,BarcodeKey!H:J, 2, FALSE))","v":""},null,null,"",""]
[null,"",null,null,null,{"$f":"IF(E49=\"\", \"\",VLOOKUP(E49, BarcodeKey!B:C, 2, FALSE))","v":""},null,{"$f":"IF(G49=\"\", \"\", VLOOKUP(G49,BarcodeKey!H:J, 2, FALSE))","v":""},null,null,"",""]
[null,"",null,null,null,{"$f":"IF(E50=\"\", \"\",VLOOKUP(E50, BarcodeKey!B:C, 2, FALSE))","v":""},null,{"$f":"IF(G50=\"\", \"\", VLOOKUP(G50,BarcodeKey!H:J, 2, FALSE))","v":""},null,null,"",""]
[null,"",null,null,null,{"$f":"IF(E51=\"\", \"\",VLOOKUP(E51, BarcodeKey!B:C, 2, FALSE))","v":""},null,{"$f":"IF(G51=\"\", \"\", VLOOKUP(G51,BarcodeKey!H:J, 2, FALSE))","v":""},null,null,"",""]
[null,"",null,null,null,{"$f":"IF(E52=\"\", \"\",VLOOKUP(E52, BarcodeKey!B:C, 2, FALSE))","v":""},null,{"$f":"IF(G52=\"\", \"\", VLOOKUP(G52,BarcodeKey!H:J, 2, FALSE))","v":""},null,null,"",""]
[null,"",null,null,null,{"$f":"IF(E53=\"\", \"\",VLOOKUP(E53, BarcodeKey!B:C, 2, FALSE))","v":""},null,{"$f":"IF(G53=\"\", \"\", VLOOKUP(G53,BarcodeKey!H:J, 2, FALSE))","v":""},null,null,"",""]
[null,"",null,null,null,{"$f":"IF(E54=\"\", \"\",VLOOKUP(E54, BarcodeKey!B:C, 2, FALSE))","v":""},null,{"$f":"IF(G54=\"\", \"\", VLOOKUP(G54,BarcodeKey!H:J, 2, FALSE))","v":""},null,null,"",""]
[null,"",null,null,null,{"$f":"IF(E55=\"\", \"\",VLOOKUP(E55, BarcodeKey!B:C, 2, FALSE))","v":""},null,{"$f":"IF(G55=\"\", \"\", VLOOKUP(G55,BarcodeKey!H:J, 2, FALSE))","v":""},null,null,"",""]
[null,"",null,null,null,{"$f":"IF(E56=\"\", \"\",VLOOKUP(E56, BarcodeKey!B:C, 2, FALSE))","v":""},null,{"$f":"IF(G56=\"\", \"\", VLOOKUP(G56,BarcodeKey!H:J, 2, FALSE))","v":""},null,null,"",""]
[null,"",null,null,null,{"$f":"IF(E57=\"\", \"\",VLOOKUP(E57, BarcodeKey!B:C, 2, FALSE))","v":""},null,{"$f":"IF(G57=\"\", \"\", VLOOKUP(G57,BarcodeKey!H:J, 2, FALSE))","v":""},null,null,"",""]
[null,"",null,null,null,{"$f":"IF(E58=\"\", \"\",VLOOKUP(E58, BarcodeKey!B:C, 2, FALSE))","v":""},null,{"$f":"IF(G58=\"\", \"\", VLOOKUP(G58,BarcodeKey!H:J, 2, FALSE))","v":""},null,null,"",""]
[null,"",null,null,null,{"$f":"IF(E59=\"\", \"\",VLOOKUP(E59, BarcodeKey!B:C, 2, FALSE))","v":""},null,{"$f":"IF(G59=\"\", \"\", VLOOKUP(G59,BarcodeKey!H:J, 2, FALSE))","v":""},null,null,"",""]
[null,"",null,null,null,{"$f":"IF(E60=\"\", \"\",VLOOKUP(E60, BarcodeKey!B:C, 2, FALSE))","v":""},null,{"$f":"IF(G60=\"\", \"\", VLOOKUP(G60,BarcodeKey!H:J, 2, FALSE))","v":""},null,null,"",""]
{"$rows_left_out":217}
{"sheet":"Password_ForSheet","index":2,"n_rows":3,"n_cols":3,"rows_kept":3,"cut":false,"hidden":false,"merged":[]}
[]
[null,"Unprotect the sheets:"]
[null,null,"SampleSheet"]

{"sheet":"BarcodeKey","index":3,"n_rows":30,"n_cols":11,"rows_kept":30,"cut":false,"hidden":false,"merged":[]}
[null,"Name","Correct","Name",null,null,"TSCA-Name","Name","i5ForMiSeq","for NextSeq","Name"]
[]
["Pillar","Pi701","ATTACTCG","Pi701",null,null,"Pillar","Pi501","TATAGCCT","AGGCTATA","Pi501"]
["Pillar","Pi702","TCCGGAGA","Pi702",null,null,"Pillar","Pi502","ATAGAGGC","GCCTCTAT","Pi502"]
["Pillar","Pi703","CGCTCATT","Pi703",null,null,"Pillar","Pi503","CCTATCCT","AGGATAGG","Pi503"]
["Pillar","Pi704","GAGATTCC","Pi704",null,null,"Pillar","Pi504","GGCTCTGA","TCAGAGCC","Pi504"]
["Pillar","Pi705","ATTCAGAA","Pi705",null,null,"Pillar","Pi505","AGGCGAAG","CTTCGCCT","Pi505"]
["Pillar","Pi706","GAATTCGT","Pi706",null,null,"Pillar","Pi506","TAATCTTA","TAAGATTA","Pi506"]
["Pillar","Pi707","CTGAAGCT","Pi707",null,null,"Pillar","Pi507","CAGGACGT","ACGTCCTG","Pi507"]
["Pillar","Pi708","TAATGCGC","Pi708",null,null,"Pillar","Pi508","GTACTGAC","GTCAGTAC","Pi508"]
["A701","Pi709","ATCACGAC","Pi709",null,null,"A501","Pi509","TGAACCTT","AAGGTTCA","Pi509"]
["A702","Pi710","ACAGTGGT","Pi710",null,null,"A502","Pi510","TGCTAAGT","ACTTAGCA","Pi510"]
["A703","Pi711","CAGATCCA","Pi711",null,null,"A503","Pi511","TGTTCTCT","AGAGAACA","Pi511"]
["A704","Pi712","ACAAACGG","Pi712",null,null,"A504","Pi512","TAAGACAC","GTGTCTTA","Pi512"]
["A709","Pi713","GAAACCCA","Pi713",null,null,"A505","Pi513","CTAATCGA","TCGATTAG","Pi513"]
["A710","Pi714","TGTGACCA","Pi714",null,null,"A506","Pi514","CTAGAACA","TGTTCTAG","Pi514"]
["A711","Pi715","AGGGTCAA","Pi715",null,null,"A507","Pi515","TAAGTTCC","GGAACTTA","Pi515"]
["A712","Pi716","AGGAGTGG","Pi716",null,null,"A508","Pi516","TAGACCTA","TAGGTCTA","Pi516"]
["TSCA","A701","ATCACGAC",null,null,null,"TSCA","A501","TGAACCTT","AAGGTTCA"]
["TSCA","A702","ACAGTGGT",null,null,null,"TSCA","A502","TGCTAAGT","ACTTAGCA"]
["TSCA","A703","CAGATCCA",null,null,null,"TSCA","A503","TGTTCTCT","AGAGAACA"]
["TSCA","A704","ACAAACGG",null,null,null,"TSCA","A504","TAAGACAC","GTGTCTTA"]
["TSCA","A705","ACCCAGCA",null,null,null,"TSCA","A505","CTAATCGA","TCGATTAG"]
["TSCA","A706","AACCCCTC",null,null,null,"TSCA","A506","CTAGAACA","TGTTCTAG"]
["TSCA","A707","CCCAACCT",null,null,null,"TSCA","A507","TAAGTTCC","GGAACTTA"]
["TSCA","A708","CACCACAC",null,null,null,"TSCA","A508","TAGACCTA","TAGGTCTA"]
["TSCA","A709","GAAACCCA"]
["TSCA","A710","TGTGACCA"]
["TSCA","A711","AGGGTCAA"]
["TSCA","A712","AGGAGTGG"]